Classpath Component Error In Opening Zip File

RECOMMENDED: If you have Windows errors then we strongly recommend that you download and run this (Windows) Repair Tool.

Ant build classpath jar generates "error in opening zip file. error in opening zip file. the error above always references the first jar listed in the classpath)

quarter – Following today’s presentation, the floor will be open for your questions. All right, let’s go to Slide 11, which is LoyaltyOne, which has the two components, Canada and then BrandLoyalty or the business based over in Europe.

Managing independent release versions and having sub-components for each build technology requires the plugin to be a first-level JIRA. Error opening zip file or JAR manifest missing. classpath "org.grails:grails-gradle-plugin:1.0",

A concept for a simple street address */ concept Address { o String city optional o String country o String street optional o String zip optional. of the files under.

Ok, I finally found the solution to my problem. It seems that there’s a bug in Eclipse which prevent the creation of the.settings/org.eclipse.wst.common.component file.

Zip and UnZip your Files with Ease. Download WinZip Now.

error: error reading /usr/bin/build-classpath; Error opening zip file /usr/bin/build-classpath 1 error What catches my eye here is:

It must be included in Spring-based applications that use classpath and. ZipException: error in opening zip file. at org.springframework.core.io.support.

Apr 25, 2017. Error: "Error opening zip file or JAR manifest missing :. COMPONENT:. FATAL – Initialization of ARMonitor failed, error – Failed to start Server Process, skip starting other process. For 9.1.00: jvm.classpath.1=.

I have a Jar file, which contains other nested Jars. When I invoke the new JarFile() constructor on this file, I get an exception which says: java.util.zip.

JDK-6295519 : javac throws ZipException when you have. a non-jar/non-zip file in the classpath. error in opening zip file 1 error $ /usr/java/jdk1.

Jan 01, 2007  · Oracle JDBC FAQ Updated March 1, 2017. This document contains answers to the most frequently asked questions about Oracle…

The pre-trained deep learning models used here are optional components. DATA_DIR – file.path(getwd(), ‘data’) if(!dir.exists(DATA_DIR)){.

The following code sample demonstrates how to use a publishing plug-in to add the output of an encode job to a Zip file by using the Open Packaging Convention components found in. operation will be canceled and an error message.

Numeric Value. Constant Value. Description. 0 %Accrual_30DPM. 30/360: all months 30 days long according to NASD rules for date truncation. 1 %Accrual_30DPME

While every effort has been made to ensure this documentation is comprehensive and there are no errors, some topics might. it will use the file named cache.xml located in the classpath root to configure it. The configuration makes use.

Jun 9, 2011. Component: Project. error: error reading /home/tester/NetBeansProjects/ JavaApplication116/${endorsed.classpath}; error in opening zip file 1.

The group policy can be found under: Administrative Templates > Windows Components > Data Collection. Extract the WDATPConnectivityAnalyzerResult.zip file created by tool in the folder used in the HardDrivePath. Open.

Migrate to Android Plugin for Gradle 3.0.0 | Android. – Known issue: If you have an existing Android Studio project that’s using an alpha version of Android plugin 3.0.0 (such as 3.0.0-alpha9), you may get the following.

System Error 6118 Has Occurred Xp 10 tips for coping with blue screen errors – Anyone who has ever experienced the notorious. computer’s event logs. Review the System log and any application-specific logs to see if any strange errors or warnings occurred just prior to the blue screen error. If such errors or. Evaluate Error Function Mathematica Erfc[z] gives the complementary
Cannot Connect To The Citrix Metaframe Server Ssl Error 29 This article provides information on Citrix Client SSL Error. * 22 The server response to socks connect request is. The Citrix SSL relay name could not. Evaluate Error Function Mathematica Erfc[z] gives the complementary error function erfc (z). Basic Examples (3). Evaluate numerically:. Tutorials. Special Functions. I am not able to get the value using

+ NEW (29 Aug 2017) + release of ANVIL 6.0 (goto download) + NEW + ANVIL is a free video annotation tool, developed by Michael Kipp. It offers multi-layered.

RECOMMENDED: Click here to fix Windows errors and improve system performance